{"text_format":"1","workbook":"xlsx","n_sheets":6,"sheets":["Record of Leave","Leave Calculator","Leave Information","Guidance","Lists","Input Variables"],"not_rendered":{"charts":0,"images":2,"macros":1,"external_links":1,"defined_names":11,"comments":0,"pivot_tables":0},"unopened":[],"bounds":{"document_bytes":16777216,"sheet_cells":100000,"rows_first":2000,"rows_last":500,"rows_between":2000,"halvings":0,"cell_chars":16384,"cell_head_chars":4096},"cells_cut":0,"cells_raw":0,"read":"whole","date_system":"1900"}

{"sheet":"Record of Leave","index":0,"n_rows":46,"n_cols":14,"rows_kept":46,"cut":false,"hidden":false,"merged":[[28,8,28,11],[30,8,30,11],[42,4,42,5],[42,8,42,11],[41,4,41,5],[41,8,41,11],[40,4,40,5],[40,8,40,11],[0,1,0,13],[36,4,36,5],[36,8,36,11],[28,4,28,5],[35,4,35,5],[35,8,35,11],[33,4,33,5],[32,4,32,5],[8,3,8,6],[9,7,9,8],[12,1,12,4],[11,1,11,6],[1,1,1,13],[2,1,2,13],[13,12,13,13],[16,1,16,13],[8,7,8,8],[13,5,13,6],[13,1,13,4],[13,8,13,11],[9,1,9,2],[4,1,4,9],[5,7,5,8],[11,8,11,13],[12,8,12,11],[7,7,7,8],[6,7,6,8],[7,1,7,2],[5,1,5,2],[6,1,6,2],[12,5,12,6],[5,3,5,6],[9,3,9,6],[7,3,7,6],[6,3,6,6],[12,12,12,13],[8,1,8,2],[17,1,17,4],[14,8,14,11],[17,12,17,13],[14,12,14,13],[17,5,17,6],[14,5,14,6],[17,8,17,11],[14,1,14,4],[18,12,18,13],[22,12,22,13],[19,12,19,13],[22,4,23,5],[18,8,18,11],[19,8,19,11],[19,1,19,4],[18,1,18,4],[22,8,23,11],[22,7,23,7],[22,1,22,2],[22,6,23,6],[19,5,19,6],[22,3,23,3],[21,1,21,13],[24,4,24,5],[25,4,25,5],[26,4,26,5],[30,4,30,5],[18,5,18,6],[34,4,34,5],[29,4,29,5],[27,4,27,5],[31,4,31,5],[39,4,39,5],[39,8,39,11],[37,4,37,5],[37,8,37,11],[38,4,38,5],[38,8,38,11]]}
[null,"This sheet should only be used for planning purposes until annual leave can be managed on Business World"]
[]
[4]
[]
[4,"RECORD OF LEAVE - 2022/23 FINANCIAL YEAR ONLY"]
[4,"Name of officer:",null,null,null,null,null," Hours per week: * †",null,37]
[4,"Name of manager:",null,null,null,null,null," Job grade: *",null,"1-7"]
[4,"Service area:",null,null,null,null,null," 5+ years service:",null,"No"]
[4,"Record start date: *",null,"2022-04-01",null,null,null," Number of weeks:",null,{"$f":"IF(K10=\"\", \"\", IF(OR(K10<0), \"Dates!\", IF(Weeks>52, \"Dates!\", Weeks)))","v":52}]
[4,"Record end date: *",null,"2023-03-31",null,null,null," Compressed hours:",null,null,{"$f":"IF(OR(D10=\"\",D9=\"\"), \"\", D10-D9)","v":364},{"$f":"IF(K10=\"\", \"\", ROUND((K10/7)/0.5, 0)*0.5)","v":52},null,"* Indicates a mandatory field"]
{"$rows_left_out":37}
{"sheet":"Leave Calculator","index":1,"n_rows":44,"n_cols":36,"rows_kept":44,"cut":false,"hidden":true,"merged":[[1,1,1,14],[2,8,2,12],[2,1,2,7],[2,13,2,14]]}
[]
[null,"ANNUAL LEAVE ENTITLEMENT CALCULATOR"]
[null,"Employee Details",null,null,null,null,null,null,"Annual Leave Entitlement",null,null,null,null,"Additional Leave"]
[null,"Name","Leave start date","Leave end date","Hours per week","Job grade","5+ years service","Compressed hours","Days or hours","Basic leave","Bank hol leave","5+ years service","Total (including Carry forward and Additional)","Carry forward","Additional leave"]
[null,null,null,null,null,null,null,null,{"$f":"IF(W5=\"\", \"\", V5)","v":""},{"$f":"IF(W5=\"\", \"\", IF(V5=\"Hours\", (W5*('Input Variables'!$E$3/5))*U5*T5, W5*U5*T5))","v":""},{"$f":"IF(OR(W5=\"\", C5=\"\",D5=\"\"), \"\", IF(V5=\"Hours\", (AJ5*('Input Variables'!$E$3/5))*U5, AJ5*U5))","v":""},{"$f":"IF(OR(E5=\"\",G5=\"\",S5=\"\"),\"\",IF(AND(G5=\"Yes\",V5=\"Hours\"),('Input Variables'!$E$8*('Input Variables'!$E$3/5))*U5*T5,IF(G5=\"Yes\",'Input Variables'!$E$8*U5*T5,0)))","v":""},{"$f":"IF(OR(F5=\"\", E5=\"\", S5=\"\"), \"\", SUM(N5,O5,J5,K5,L5))","v":""},null,null,{"$f":"IF(S5=\"Check dates!\", CONCATENATE(\" \",S5), \"\")","v":""},{"$f":"IF(OR(C5=\"\",D5=\"\"), \"\", D5-C5)","v":""},{"$f":"IF(Q5=\"\", \"\", ROUND((Q5/7)/0.5, 0)*0.5)","v":""},{"$f":"IF(Q5=\"\", \"\", IF(OR(Q5<0), \"Check dates!\", IF(R5>52, \"Check dates!\", R5)))","v":""},{"$f":"IF(OR(S5=\"Check dates!\",S5=\"\"), 0, S5/52)","v":0},{"$f":"E5/'Input Variables'!$E$3","v":0},{"$f":"IF(E5=\"\",\"Days\",IF(E5<37,\"Hours\",IF(H5=\"Yes\",\"Hours\",\"Days\")))","v":"Days"},{"$f":"IF(OR(F5=\"\",E5=\"\",S5=\"\"),\"\",IF(F5='Input Variables'!$E$4,'Input Variables'!$E$6,IF(F5='Input Variables'!$E$5,'Input Variables'!$E$7)))","v":""},{"$f":"IF(W5=\"\", \"\", IF(V5=\"Hours\", (W5*'Input Variables'!$E$3/5)*U5, W5*U5))","v":""},{"$f":"IF(OR(C5=\"\",D5=\"\"),\"\",IF(AND('Input Variables'!$E$9>=C5,'Input Variables'!$E$9<=D5),1,0))","v":""},{"$f":"IF(OR(C5=\"\",D5=\"\"),\"\",IF(AND('Input Variables'!$E$10>=C5,'Input Variables'!$E$10<=D5),1,0))","v":""},{"$f":"IF(OR(C5=\"\",D5=\"\"),\"\",IF(AND('Input Variables'!$E$11>=C5,'Input Variables'!$E$11<=D5),1,0))","v":""},{"$f":"IF(OR(C5=\"\",D5=\"\"),\"\",IF(AND('Input Variables'!$E$12>=C5,'Input Variables'!$E$12<=D5),1,0))","v":""},{"$f":"IF(OR(C5=\"\",D5=\"\"),\"\",IF(AND('Input Variables'!$E$13>=C5,'Input Variables'!$E$13<=D5),1,0))","v":""},{"$f":"IF(OR(C5=\"\",D5=\"\"),\"\",IF(AND('Input Variables'!$E$14>=C5,'Input Variables'!$E$14<=D5),1,0))","v":""},{"$f":"IF(OR(C5=\"\",D5=\"\"),\"\",IF(AND('Input Variables'!$E$15>=C5,'Input Variables'!$E$15<=D5),1,0))","v":""},{"$f":"IF(OR(C5=\"\",D5=\"\"),\"\",IF(AND('Input Variables'!$E$16>=C5,'Input Variables'!$E$16<=D5),1,0))","v":""},{"$f":"IF(OR(C5=\"\",D5=\"\"),\"\",IF(AND('Input Variables'!$E$17>=C5,'Input Variables'!$E$17<=D5),1,0))","v":""},{"$f":"IF(OR(C5=\"\",D5=\"\"),\"\",IF(AND('Input Variables'!$E$18>=C5,'Input Variables'!$E$18<=D5),1,0))","v":""},{"$f":"IF(OR(C5=\"\",D5=\"\"),\"\",IF(AND('Input Variables'!$E$19>=C5,'Input Variables'!$E$19<=D5),1,0))","v":""},{"$f":"SUM(Y5:AI5)","v":0}]
[null,null,null,null,null,null,null,null,{"$f":"IF(W6=\"\", \"\", V6)","v":""},{"$f":"IF(W6=\"\", \"\", IF(V6=\"Hours\", (W6*('Input Variables'!$E$3/5))*U6*T6, W6*U6*T6))","v":""},{"$f":"IF(OR(W6=\"\", C6=\"\",D6=\"\"), \"\", IF(V6=\"Hours\", (AJ6*('Input Variables'!$E$3/5))*U6, AJ6*U6))","v":""},{"$f":"IF(OR(E6=\"\",G6=\"\",S6=\"\"),\"\",IF(AND(G6=\"Yes\",V6=\"Hours\"),('Input Variables'!$E$8*('Input Variables'!$E$3/5))*U6*T6,IF(G6=\"Yes\",'Input Variables'!$E$8*U6*T6,0)))","v":""},"",null,null,"","",{"$f":"IF(Q6=\"\", \"\", ROUND((Q6/7)/0.5, 0)*0.5)","v":""},{"$f":"IF(Q6=\"\", \"\", IF(OR(Q6<0), \"Check dates!\", IF(R6>52, \"Check dates!\", R6)))","v":""},{"$f":"IF(OR(S6=\"Check dates!\",S6=\"\"), 0, S6/52)","v":0},{"$f":"E6/'Input Variables'!$E$3","v":0},"Days",{"$f":"IF(OR(F6=\"\",E6=\"\",S6=\"\"),\"\",IF(F6='Input Variables'!$E$4,'Input Variables'!$E$6,IF(F6='Input Variables'!$E$5,'Input Variables'!$E$7)))","v":""},{"$f":"IF(W6=\"\", \"\", IF(V6=\"Hours\", (W6*'Input Variables'!$E$3/5)*U6, W6*U6))","v":""},{"$f":"IF(OR(C6=\"\",D6=\"\"),\"\",IF(AND('Input Variables'!$E$9>=C6,'Input Variables'!$E$9<=D6),1,0))","v":""},{"$f":"IF(OR(C6=\"\",D6=\"\"),\"\",IF(AND('Input Variables'!$E$10>=C6,'Input Variables'!$E$10<=D6),1,0))","v":""},{"$f":"IF(OR(C6=\"\",D6=\"\"),\"\",IF(AND('Input Variables'!$E$11>=C6,'Input Variables'!$E$11<=D6),1,0))","v":""},{"$f":"IF(OR(C6=\"\",D6=\"\"),\"\",IF(AND('Input Variables'!$E$12>=C6,'Input Variables'!$E$12<=D6),1,0))","v":""},{"$f":"IF(OR(C6=\"\",D6=\"\"),\"\",IF(AND('Input Variables'!$E$13>=C6,'Input Variables'!$E$13<=D6),1,0))","v":""},{"$f":"IF(OR(C6=\"\",D6=\"\"),\"\",IF(AND('Input Variables'!$E$14>=C6,'Input Variables'!$E$14<=D6),1,0))","v":""},{"$f":"IF(OR(C6=\"\",D6=\"\"),\"\",IF(AND('Input Variables'!$E$15>=C6,'Input Variables'!$E$15<=D6),1,0))","v":""},{"$f":"IF(OR(C6=\"\",D6=\"\"),\"\",IF(AND('Input Variables'!$E$16>=C6,'Input Variables'!$E$16<=D6),1,0))","v":""},{"$f":"IF(OR(C6=\"\",D6=\"\"),\"\",IF(AND('Input Variables'!$E$17>=C6,'Input Variables'!$E$17<=D6),1,0))","v":""},{"$f":"IF(OR(C6=\"\",D6=\"\"),\"\",IF(AND('Input Variables'!$E$18>=C6,'Input Variables'!$E$18<=D6),1,0))","v":""},{"$f":"IF(OR(C6=\"\",D6=\"\"),\"\",IF(AND('Input Variables'!$E$19>=C6,'Input Variables'!$E$19<=D6),1,0))","v":""},{"$f":"SUM(Y6:AI6)","v":0}]
[null,null,null,null,null,null,null,null,"",{"$f":"IF(W7=\"\", \"\", IF(V7=\"Hours\", (W7*('Input Variables'!$E$3/5))*U7*T7, W7*U7*T7))","v":""},{"$f":"IF(OR(W7=\"\", C7=\"\",D7=\"\"), \"\", IF(V7=\"Hours\", (AJ7*('Input Variables'!$E$3/5))*U7, AJ7*U7))","v":""},{"$f":"IF(OR(E7=\"\",G7=\"\",S7=\"\"),\"\",IF(AND(G7=\"Yes\",V7=\"Hours\"),('Input Variables'!$E$8*('Input Variables'!$E$3/5))*U7*T7,IF(G7=\"Yes\",'Input Variables'!$E$8*U7*T7,0)))","v":""},"",null,null,"","","","",0,{"$f":"E7/'Input Variables'!$E$3","v":0},"Days",{"$f":"IF(OR(F7=\"\",E7=\"\",S7=\"\"),\"\",IF(F7='Input Variables'!$E$4,'Input Variables'!$E$6,IF(F7='Input Variables'!$E$5,'Input Variables'!$E$7)))","v":""},{"$f":"IF(W7=\"\", \"\", IF(V7=\"Hours\", (W7*'Input Variables'!$E$3/5)*U7, W7*U7))","v":""},{"$f":"IF(OR(C7=\"\",D7=\"\"),\"\",IF(AND('Input Variables'!$E$9>=C7,'Input Variables'!$E$9<=D7),1,0))","v":""},{"$f":"IF(OR(C7=\"\",D7=\"\"),\"\",IF(AND('Input Variables'!$E$10>=C7,'Input Variables'!$E$10<=D7),1,0))","v":""},{"$f":"IF(OR(C7=\"\",D7=\"\"),\"\",IF(AND('Input Variables'!$E$11>=C7,'Input Variables'!$E$11<=D7),1,0))","v":""},{"$f":"IF(OR(C7=\"\",D7=\"\"),\"\",IF(AND('Input Variables'!$E$12>=C7,'Input Variables'!$E$12<=D7),1,0))","v":""},{"$f":"IF(OR(C7=\"\",D7=\"\"),\"\",IF(AND('Input Variables'!$E$13>=C7,'Input Variables'!$E$13<=D7),1,0))","v":""},{"$f":"IF(OR(C7=\"\",D7=\"\"),\"\",IF(AND('Input Variables'!$E$14>=C7,'Input Variables'!$E$14<=D7),1,0))","v":""},{"$f":"IF(OR(C7=\"\",D7=\"\"),\"\",IF(AND('Input Variables'!$E$15>=C7,'Input Variables'!$E$15<=D7),1,0))","v":""},{"$f":"IF(OR(C7=\"\",D7=\"\"),\"\",IF(AND('Input Variables'!$E$16>=C7,'Input Variables'!$E$16<=D7),1,0))","v":""},{"$f":"IF(OR(C7=\"\",D7=\"\"),\"\",IF(AND('Input Variables'!$E$17>=C7,'Input Variables'!$E$17<=D7),1,0))","v":""},{"$f":"IF(OR(C7=\"\",D7=\"\"),\"\",IF(AND('Input Variables'!$E$18>=C7,'Input Variables'!$E$18<=D7),1,0))","v":""},{"$f":"IF(OR(C7=\"\",D7=\"\"),\"\",IF(AND('Input Variables'!$E$19>=C7,'Input Variables'!$E$19<=D7),1,0))","v":""},0]
[null,null,null,null,null,null,null,null,"",{"$f":"IF(W8=\"\", \"\", IF(V8=\"Hours\", (W8*('Input Variables'!$E$3/5))*U8*T8, W8*U8*T8))","v":""},{"$f":"IF(OR(W8=\"\", C8=\"\",D8=\"\"), \"\", IF(V8=\"Hours\", (AJ8*('Input Variables'!$E$3/5))*U8, AJ8*U8))","v":""},{"$f":"IF(OR(E8=\"\",G8=\"\",S8=\"\"),\"\",IF(AND(G8=\"Yes\",V8=\"Hours\"),('Input Variables'!$E$8*('Input Variables'!$E$3/5))*U8*T8,IF(G8=\"Yes\",'Input Variables'!$E$8*U8*T8,0)))","v":""},"",null,null,"","","","",0,{"$f":"E8/'Input Variables'!$E$3","v":0},"Days",{"$f":"IF(OR(F8=\"\",E8=\"\",S8=\"\"),\"\",IF(F8='Input Variables'!$E$4,'Input Variables'!$E$6,IF(F8='Input Variables'!$E$5,'Input Variables'!$E$7)))","v":""},{"$f":"IF(W8=\"\", \"\", IF(V8=\"Hours\", (W8*'Input Variables'!$E$3/5)*U8, W8*U8))","v":""},{"$f":"IF(OR(C8=\"\",D8=\"\"),\"\",IF(AND('Input Variables'!$E$9>=C8,'Input Variables'!$E$9<=D8),1,0))","v":""},{"$f":"IF(OR(C8=\"\",D8=\"\"),\"\",IF(AND('Input Variables'!$E$10>=C8,'Input Variables'!$E$10<=D8),1,0))","v":""},{"$f":"IF(OR(C8=\"\",D8=\"\"),\"\",IF(AND('Input Variables'!$E$11>=C8,'Input Variables'!$E$11<=D8),1,0))","v":""},{"$f":"IF(OR(C8=\"\",D8=\"\"),\"\",IF(AND('Input Variables'!$E$12>=C8,'Input Variables'!$E$12<=D8),1,0))","v":""},{"$f":"IF(OR(C8=\"\",D8=\"\"),\"\",IF(AND('Input Variables'!$E$13>=C8,'Input Variables'!$E$13<=D8),1,0))","v":""},{"$f":"IF(OR(C8=\"\",D8=\"\"),\"\",IF(AND('Input Variables'!$E$14>=C8,'Input Variables'!$E$14<=D8),1,0))","v":""},{"$f":"IF(OR(C8=\"\",D8=\"\"),\"\",IF(AND('Input Variables'!$E$15>=C8,'Input Variables'!$E$15<=D8),1,0))","v":""},{"$f":"IF(OR(C8=\"\",D8=\"\"),\"\",IF(AND('Input Variables'!$E$16>=C8,'Input Variables'!$E$16<=D8),1,0))","v":""},{"$f":"IF(OR(C8=\"\",D8=\"\"),\"\",IF(AND('Input Variables'!$E$17>=C8,'Input Variables'!$E$17<=D8),1,0))","v":""},{"$f":"IF(OR(C8=\"\",D8=\"\"),\"\",IF(AND('Input Variables'!$E$18>=C8,'Input Variables'!$E$18<=D8),1,0))","v":""},{"$f":"IF(OR(C8=\"\",D8=\"\"),\"\",IF(AND('Input Variables'!$E$19>=C8,'Input Variables'!$E$19<=D8),1,0))","v":""},0]
[null,null,null,null,null,null,null,null,"",{"$f":"IF(W9=\"\", \"\", IF(V9=\"Hours\", (W9*('Input Variables'!$E$3/5))*U9*T9, W9*U9*T9))","v":""},{"$f":"IF(OR(W9=\"\", C9=\"\",D9=\"\"), \"\", IF(V9=\"Hours\", (AJ9*('Input Variables'!$E$3/5))*U9, AJ9*U9))","v":""},{"$f":"IF(OR(E9=\"\",G9=\"\",S9=\"\"),\"\",IF(AND(G9=\"Yes\",V9=\"Hours\"),('Input Variables'!$E$8*('Input Variables'!$E$3/5))*U9*T9,IF(G9=\"Yes\",'Input Variables'!$E$8*U9*T9,0)))","v":""},"",null,null,"","","","",0,{"$f":"E9/'Input Variables'!$E$3","v":0},"Days",{"$f":"IF(OR(F9=\"\",E9=\"\",S9=\"\"),\"\",IF(F9='Input Variables'!$E$4,'Input Variables'!$E$6,IF(F9='Input Variables'!$E$5,'Input Variables'!$E$7)))","v":""},{"$f":"IF(W9=\"\", \"\", IF(V9=\"Hours\", (W9*'Input Variables'!$E$3/5)*U9, W9*U9))","v":""},{"$f":"IF(OR(C9=\"\",D9=\"\"),\"\",IF(AND('Input Variables'!$E$9>=C9,'Input Variables'!$E$9<=D9),1,0))","v":""},{"$f":"IF(OR(C9=\"\",D9=\"\"),\"\",IF(AND('Input Variables'!$E$10>=C9,'Input Variables'!$E$10<=D9),1,0))","v":""},{"$f":"IF(OR(C9=\"\",D9=\"\"),\"\",IF(AND('Input Variables'!$E$11>=C9,'Input Variables'!$E$11<=D9),1,0))","v":""},{"$f":"IF(OR(C9=\"\",D9=\"\"),\"\",IF(AND('Input Variables'!$E$12>=C9,'Input Variables'!$E$12<=D9),1,0))","v":""},{"$f":"IF(OR(C9=\"\",D9=\"\"),\"\",IF(AND('Input Variables'!$E$13>=C9,'Input Variables'!$E$13<=D9),1,0))","v":""},{"$f":"IF(OR(C9=\"\",D9=\"\"),\"\",IF(AND('Input Variables'!$E$14>=C9,'Input Variables'!$E$14<=D9),1,0))","v":""},{"$f":"IF(OR(C9=\"\",D9=\"\"),\"\",IF(AND('Input Variables'!$E$15>=C9,'Input Variables'!$E$15<=D9),1,0))","v":""},{"$f":"IF(OR(C9=\"\",D9=\"\"),\"\",IF(AND('Input Variables'!$E$16>=C9,'Input Variables'!$E$16<=D9),1,0))","v":""},{"$f":"IF(OR(C9=\"\",D9=\"\"),\"\",IF(AND('Input Variables'!$E$17>=C9,'Input Variables'!$E$17<=D9),1,0))","v":""},{"$f":"IF(OR(C9=\"\",D9=\"\"),\"\",IF(AND('Input Variables'!$E$18>=C9,'Input Variables'!$E$18<=D9),1,0))","v":""},{"$f":"IF(OR(C9=\"\",D9=\"\"),\"\",IF(AND('Input Variables'!$E$19>=C9,'Input Variables'!$E$19<=D9),1,0))","v":""},0]
[null,null,null,null,null,null,null,null,"",{"$f":"IF(W10=\"\", \"\", IF(V10=\"Hours\", (W10*('Input Variables'!$E$3/5))*U10*T10, W10*U10*T10))","v":""},{"$f":"IF(OR(W10=\"\", C10=\"\",D10=\"\"), \"\", IF(V10=\"Hours\", (AJ10*('Input Variables'!$E$3/5))*U10, AJ10*U10))","v":""},{"$f":"IF(OR(E10=\"\",G10=\"\",S10=\"\"),\"\",IF(AND(G10=\"Yes\",V10=\"Hours\"),('Input Variables'!$E$8*('Input Variables'!$E$3/5))*U10*T10,IF(G10=\"Yes\",'Input Variables'!$E$8*U10*T10,0)))","v":""},"",null,null,"","","","",0,{"$f":"E10/'Input Variables'!$E$3","v":0},"Days",{"$f":"IF(OR(F10=\"\",E10=\"\",S10=\"\"),\"\",IF(F10='Input Variables'!$E$4,'Input Variables'!$E$6,IF(F10='Input Variables'!$E$5,'Input Variables'!$E$7)))","v":""},{"$f":"IF(W10=\"\", \"\", IF(V10=\"Hours\", (W10*'Input Variables'!$E$3/5)*U10, W10*U10))","v":""},{"$f":"IF(OR(C10=\"\",D10=\"\"),\"\",IF(AND('Input Variables'!$E$9>=C10,'Input Variables'!$E$9<=D10),1,0))","v":""},{"$f":"IF(OR(C10=\"\",D10=\"\"),\"\",IF(AND('Input Variables'!$E$10>=C10,'Input Variables'!$E$10<=D10),1,0))","v":""},{"$f":"IF(OR(C10=\"\",D10=\"\"),\"\",IF(AND('Input Variables'!$E$11>=C10,'Input Variables'!$E$11<=D10),1,0))","v":""},{"$f":"IF(OR(C10=\"\",D10=\"\"),\"\",IF(AND('Input Variables'!$E$12>=C10,'Input Variables'!$E$12<=D10),1,0))","v":""},{"$f":"IF(OR(C10=\"\",D10=\"\"),\"\",IF(AND('Input Variables'!$E$13>=C10,'Input Variables'!$E$13<=D10),1,0))","v":""},{"$f":"IF(OR(C10=\"\",D10=\"\"),\"\",IF(AND('Input Variables'!$E$14>=C10,'Input Variables'!$E$14<=D10),1,0))","v":""},{"$f":"IF(OR(C10=\"\",D10=\"\"),\"\",IF(AND('Input Variables'!$E$15>=C10,'Input Variables'!$E$15<=D10),1,0))","v":""},{"$f":"IF(OR(C10=\"\",D10=\"\"),\"\",IF(AND('Input Variables'!$E$16>=C10,'Input Variables'!$E$16<=D10),1,0))","v":""},{"$f":"IF(OR(C10=\"\",D10=\"\"),\"\",IF(AND('Input Variables'!$E$17>=C10,'Input Variables'!$E$17<=D10),1,0))","v":""},{"$f":"IF(OR(C10=\"\",D10=\"\"),\"\",IF(AND('Input Variables'!$E$18>=C10,'Input Variables'!$E$18<=D10),1,0))","v":""},{"$f":"IF(OR(C10=\"\",D10=\"\"),\"\",IF(AND('Input Variables'!$E$19>=C10,'Input Variables'!$E$19<=D10),1,0))","v":""},0]
{"$rows_left_out":35}
{"sheet":"Leave Information","index":2,"n_rows":50,"n_cols":8,"rows_kept":50,"cut":false,"hidden":false,"merged":[[49,1,49,9],[48,1,48,9],[47,1,47,9],[42,1,42,9],[39,1,39,9],[45,1,45,9],[44,1,44,9],[43,1,43,9],[41,1,41,9],[11,5,11,6],[11,3,11,4],[13,1,13,9],[12,1,12,2],[11,1,11,2],[1,1,1,6],[6,1,6,9],[5,1,5,9],[12,7,12,8],[11,7,11,8],[12,3,12,4],[4,1,4,9],[10,1,10,2],[3,1,3,9],[10,3,10,4],[10,5,10,6],[10,7,10,8],[9,1,9,9],[8,1,8,9],[7,1,7,9],[12,5,12,6],[14,1,14,9],[46,1,46,9],[18,1,18,2],[18,3,18,4],[18,5,18,6],[18,7,18,8],[15,1,15,9],[40,1,40,9],[16,1,16,2],[16,3,16,4],[16,5,16,6],[16,7,16,8],[17,1,17,2],[17,3,17,4],[17,5,17,6],[17,7,17,8],[20,1,20,9],[19,1,19,9],[21,1,21,9],[22,1,22,9],[23,1,23,9],[24,1,24,9],[25,1,25,9],[26,1,26,9],[27,1,27,9],[28,1,28,9],[29,1,29,9],[30,1,30,9],[31,1,31,9],[33,1,33,9],[32,1,32,9],[35,1,35,9],[34,1,34,9],[36,1,36,9],[37,1,37,9],[38,1,38,9]]}
[]
[null,"LEAVE INFORMATION"]
[]
[null,"Leave year / Timing of leave:"]
[null,"> The leave year normally runs from 1st April to 31st March but may be varied to suit service needs."]
[null,"> The timing of all leave is subject to the approval of the manager."]
[]
[null,"Entitlement:"]
[null,"> The annual leave entitlement excluding bank holidays is as follows:"]
[]
{"$rows_left_out":41}
{"sheet":"Guidance","index":3,"n_rows":40,"n_cols":10,"rows_kept":40,"cut":false,"hidden":false,"merged":[[17,1,17,9],[16,1,16,9],[23,1,23,9],[22,1,22,9],[18,1,18,9],[1,1,1,6],[21,1,21,9],[4,1,4,9],[3,1,3,9],[13,1,13,9],[5,1,5,9],[6,1,6,9],[10,1,10,9],[11,1,11,9],[12,1,12,9],[14,1,14,9],[7,1,7,9],[19,1,19,9],[20,1,20,9],[9,1,9,9],[15,1,15,9],[39,1,39,9],[25,1,25,9],[29,1,29,9],[27,1,27,5],[24,1,24,9]]}
[]
[null,"GUIDANCE"]
[]
[null,"Completing the Record of Leave:"]
[null,"> Complete each of the fields under the RECORD OF LEAVE heading: Name of officer, Name of manager, Service area, Record start date, Record end date and Hours per week. Select your Job grade, whether you qualify for Additional days for 5+ years continuous service and whether or not you work Compressed hours."]
[null,"> Your leave entitlements (excluding carry forward and additional) will be calculated based on what you put in Hours per week, the Job grade you select, whether you qualify for Additional days for 5+ years continuous service, the Record start and end dates you enter and the Number of weeks (calculated based on Record start and end dates)."]
[null,"> Carried Forward / Advanced Leave: You should enter the Number of days/hours carried forward in this section."]
[null,"> Annual Leave Entitlement: You should enter any Additional days/hours in this section, for example agreed unpaid leave.  The TOTAL LEAVE ENTITLEMENT will be calculated based on combining Basic leave entitlement, Bank holiday entitlement, Additional days for continuous service, Number of days carried forward and Additional days (e.g. unpaid)."]
[]
[null,"Completing Detailed Record of Leave:"]
{"$rows_left_out":31}
{"sheet":"Lists","index":4,"n_rows":45,"n_cols":11,"rows_kept":45,"cut":false,"hidden":true,"merged":[]}
[{"$f":"UserNameWindows()","v":"Graham.Johnson"},23,"Annual",170.2,28,{"$f":"E1*7.4","v":207.20000000000002}]
[{"$f":"TODAY()","v":"2021-12-30"},24,"Bank Hol",177.6,29,{"$f":"E2*7.4","v":214.60000000000002}]
[null,27,"Designated",199.8,32,{"$f":"E3*7.4","v":236.8}]
[null,28,"Flexi",207.2,33,{"$f":"E4*7.4","v":244.20000000000002}]
[null,null,"Special"]
[null,"Days","Disability"]
[null,"Hours","Cancelled"]
[null,{"$f":"IF('Record of Leave'!I11=\"Hours\", \"hours\", \"days\")","v":"days"},"Other"]
[null,"Number of "," carried forward:",{"$f":"CONCATENATE(B9,$B$8,C9)","v":"Number of days carried forward:"}]
[null,"Number of standard ",":",{"$f":"CONCATENATE(B10,$B$8,C10)","v":"Number of standard days:"}]
{"$rows_left_out":36}
{"sheet":"Input Variables","index":5,"n_rows":21,"n_cols":6,"rows_kept":21,"cut":false,"hidden":true,"merged":[[7,1,7,3],[1,1,1,4],[2,1,2,3],[3,1,3,3],[4,1,4,3],[5,1,5,3],[6,1,6,3],[13,1,13,3],[19,1,19,3],[20,1,20,3],[8,1,8,3],[9,1,9,3],[10,1,10,3],[11,1,11,3],[12,1,12,3],[14,1,14,3],[15,1,15,3],[16,1,16,3],[17,1,17,3],[18,1,18,3]]}
[]
[null,"INPUT VARABLES"]
[null,"FTE Hours:",null,null,37]
[null,"Lower grade band:",null,null,"1-7"]
[null,"Higher grade band:",null,null,"8-16"]
[null,"Lower grade band leave:",null,null,24]
[null,"Higher grade band leave:",null,null,27]
[null,"Continuous service days:",null,null,5]
[null,"Bank holiday 1:",null,null,"2022-04-15",{"$f":"IF(OR('Record of Leave'!$D$9=\"\",'Record of Leave'!$D$10=\"\"),\"\",IF(AND(E9>='Record of Leave'!$D$9,E9<='Record of Leave'!$D$10),1,0))","v":1}]
[null,"Bank holiday 2:",null,null,"2022-04-18",{"$f":"IF(OR('Record of Leave'!$D$9=\"\",'Record of Leave'!$D$10=\"\"),\"\",IF(AND(E10>='Record of Leave'!$D$9,E10<='Record of Leave'!$D$10),1,0))","v":1}]
{"$rows_left_out":11}